➜

This issue tracker has been migrated to GitHub, and is currently read-only.
For more information, see the GitHub FAQs in the Python's Developer Guide.

作者 makaron
收信人
日期 2002-10-29.11:28:39
SpamBayes Score
Marked as misclassified
Message-id
In-reply-to
内容
Logged In: YES 
user_id=115179

Python 2.2.2 from October 14, 2002, compiled from source on
windows 2000
all expected test are passed but not test_email.
reproducable by:
pushd Lib\test
..\..\python regrtest.py
popd
--
or
cd Lib\test
..\..\python test_email.py

traceback:
FAILED (failures=1)
Traceback (most recent call last):
  File "test_email.py", line 13, in ?
    test_main()
  File "test_email.py", line 10, in test_main
    run_suite(suite())
  File "c:\binw\py222\lib\test\test_support.py", line 175,
in run_suite
    raise TestFailed(err)
test_support.TestFailed: Traceback (most recent call last):
  File "c:\binw\py222\lib\email\test\test_email.py", line
1851, in test_crlf_sep
aration
    eq(part1.get_payload(), 'Simple email with
attachment.\r\n\r\n')
  File "c:\binw\py222\lib\unittest.py", line 286, in
failUnlessEqual
    raise self.failureException, \
AssertionError: 'Simple email with attachment.\n\n' !=
'Simple email with attach
ment.\r\n\r\n'

after applying this patch thist test will pass
--- test_email.py       Mon Oct 14 17:26:03 2002
+++ test_email.py.new  Tue Oct 29 11:25:54 2002
@@ -46,7 +46,7 @@
 
 def openfile(filename):
     path = os.path.join(os.path.dirname(landmark), 'data',
filename)
-    return open(path, 'r')
+    return open(path, 'rb')
历史
日期 用户 动作 参数
2007-08-23 14:07:37admin链接issue629756 messages
2007-08-23 14:07:37admin创建