消息 [200973]
With pure clone of https://github.com/python/cpython.git (no patches applied whatsoever, and the last commit is https://github.com/python/cpython/commit/650406fe7373f31b595b381d4f2f02065607386a) and pure
./configure && make -j2 && make -j2 test I get one failed test:
======================================================================
ERROR: test_linux_constants (test.test_resource.ResourceTest)
----------------------------------------------------------------------
Traceback (most recent call last):
File "/home/matej/Repos/cpython/Lib/test/test_resource.py", line 139, in test_linux_constants
self.assertIsInstance(resource.RLIMIT_RTTIME, int)
AttributeError: 'module' object has no attribute 'RLIMIT_RTTIME'
----------------------------------------------------------------------
Ran 9 tests in 0.468s
FAILED (errors=1, skipped=1)
test test_resource failed
make: *** [test] Error 1 |
|
| 日期 |
用户 |
动作 |
参数 |
| 2013-10-22 17:14:26 | mcepl | 修改 | recipients:
+ mcepl |
| 2013-10-22 17:14:26 | mcepl | 修改 | messageid: <1382462066.11.0.516691894777.issue19353@psf.upfronthosting.co.za> |
| 2013-10-22 17:14:26 | mcepl | 链接 | issue19353 messages |
| 2013-10-22 17:14:25 | mcepl | 创建 | |
|