This issue tracker has been migrated to GitHub, and is currently read-only.
For more information, see the GitHub FAQs in the Python's Developer Guide.

作者 rhettinger
收信人 loewis, rhettinger
日期 2008-12-04.03:15:16
SpamBayes Score 0.0012548962
Marked as misclassified
Message-id <1228360519.8.0.091239531214.issue4514@psf.upfronthosting.co.za>
In-reply-to
内容
test_binascii.py fails because crc32 accepts a string.

From my WindowsXP box:

C:\Python30>python \python30\lib\test\test_binascii.py
test_base64invalid (__main__.BinASCIITest) ... ok
test_base64valid (__main__.BinASCIITest) ... ok
test_crc32 (__main__.BinASCIITest) ... ok
test_empty_string (__main__.BinASCIITest) ... ok
test_exceptions (__main__.BinASCIITest) ... ok
test_functions (__main__.BinASCIITest) ... ok
test_hex (__main__.BinASCIITest) ... ok
test_no_binary_strings (__main__.BinASCIITest) ... FAIL
test_qp (__main__.BinASCIITest) ... ok
test_uu (__main__.BinASCIITest) ... ok

======================================================================
FAIL: test_no_binary_strings (__main__.BinASCIITest)
----------------------------------------------------------------------
Traceback (most recent call last):
  File "\python30\lib\test\test_binascii.py", line 177, in
test_no_binary_strings
    self.assertRaises(TypeError, f, "test")
AssertionError: TypeError not raised by crc32

----------------------------------------------------------------------
Ran 10 tests in 0.016s

FAILED (failures=1)
Traceback (most recent call last):
  File "\python30\lib\test\test_binascii.py", line 183, in <module>
    test_main()
  File "\python30\lib\test\test_binascii.py", line 180, in test_main
    support.run_unittest(BinASCIITest)
  File "C:\Python30\lib\test\support.py", line 698, in run_unittest
    _run_suite(suite)
  File "C:\Python30\lib\test\support.py", line 681, in _run_suite
    raise TestFailed(err)
test.support.TestFailed: Traceback (most recent call last):
  File "\python30\lib\test\test_binascii.py", line 177, in
test_no_binary_strings
    self.assertRaises(TypeError, f, "test")
AssertionError: TypeError not raised by crc32
历史
日期 用户 动作 参数
2008-12-04 03:15:20rhettinger修改recipients: + rhettinger, loewis
2008-12-04 03:15:19rhettinger修改messageid: <1228360519.8.0.091239531214.issue4514@psf.upfronthosting.co.za>
2008-12-04 03:15:18rhettinger链接issue4514 messages
2008-12-04 03:15:17rhettinger创建